{"text_format":"1","workbook":"xlsx","n_sheets":5,"sheets":["Summary","Main Budget","salary worksheet","fringe rates table","Assumptions"],"not_rendered":{"charts":0,"images":0,"macros":1,"external_links":2,"defined_names":10,"comments":2,"pivot_tables":0},"unopened":[],"bounds":{"document_bytes":16777216,"sheet_cells":100000,"rows_first":2000,"rows_last":500,"rows_between":2000,"halvings":0,"cell_chars":16384,"cell_head_chars":4096},"cells_cut":0,"cells_raw":0,"read":"whole","date_system":"1900"}

{"sheet":"Summary","index":0,"n_rows":31,"n_cols":12,"rows_kept":31,"cut":false,"hidden":false,"merged":[[2,1,2,11],[1,1,1,11]]}
["Principal Investigator",{"$f":"'Main Budget'!C1","v":0}]
["Project Sponsor",{"$f":"'Main Budget'!C4","v":0}]
["Project Title",{"$f":"'Main Budget'!C5","v":0}]
["Project Start Date",{"$f":"'Main Budget'!C2","v":"00:00:00"}]
["Project End Date",{"$f":"'Main Budget'!C3","v":"00:00:00"}]
[]
[]
[]
[null,null,"Year 1",null,"Year 2",null,"Year 3",null,"Year 4",null,"Year 5"]
["Personnel Costs",null,{"$f":"'Main Budget'!G7","v":"00 Jan '00- 30 Dec '00"},null,{"$f":"'Main Budget'!I7","v":"31 Dec '00 - 30 Dec '01"},null,{"$f":"'Main Budget'!K7","v":"31 Dec '01 - 30 Dec '02"},null,{"$f":"'Main Budget'!M7","v":"31 Dec '02 - 30 Dec '03"},null,{"$f":"'Main Budget'!O7","v":"31 Dec '03 - 30 Dec '04"},"Total"]
["Total Salary",null,{"$f":"'Main Budget'!G18","v":0},null,{"$f":"'Main Budget'!I18","v":0},null,{"$f":"'Main Budget'!K18","v":0},null,{"$f":"'Main Budget'!M18","v":0},null,{"$f":"'Main Budget'!O18","v":0},{"$f":"'Main Budget'!P18","v":0}]
["Fringe Costs",null,{"$f":"'Main Budget'!G20","v":0},null,{"$f":"'Main Budget'!I20","v":0},null,{"$f":"'Main Budget'!K20","v":0},null,{"$f":"'Main Budget'!M20","v":0},null,{"$f":"'Main Budget'!O20","v":0},{"$f":"Sumvisible(C12:K12)","v":0}]
["Total Salary and Fringe",null,{"$f":"C11+C12","v":0},null,{"$f":"E11+E12","v":0},null,0,null,0,null,0,{"$f":"Sumvisible(C13:K13)","v":0}]
[]
["Research Travel",null,{"$f":"'Main Budget'!G40","v":0},null,{"$f":"'Main Budget'!I40","v":0},null,{"$f":"'Main Budget'!K40","v":0},null,{"$f":"'Main Budget'!M40","v":0},null,{"$f":"'Main Budget'!O40","v":0},{"$f":"Sumvisible(C15:K15)","v":0}]
[]
["Course Support",null,{"$f":"'Main Budget'!G61","v":0},null,{"$f":"'Main Budget'!I61","v":0},null,{"$f":"'Main Budget'!K61","v":0},null,{"$f":"'Main Budget'!M61","v":0},null,{"$f":"'Main Budget'!O61","v":0},{"$f":"Sumvisible(C17:K17)","v":0}]
[]
["Workshop Costs",null,{"$f":"'Main Budget'!G83","v":0},null,{"$f":"'Main Budget'!I83","v":0},null,{"$f":"'Main Budget'!K83","v":0},null,{"$f":"'Main Budget'!M83","v":0},null,{"$f":"'Main Budget'!O83","v":0},{"$f":"Sumvisible(C19:K19)","v":0}]
[]
["Publication Expenses",null,{"$f":"'Main Budget'!G68","v":0},null,{"$f":"'Main Budget'!I68","v":0},null,{"$f":"'Main Budget'!K68","v":0},null,{"$f":"'Main Budget'!M68","v":0},null,{"$f":"'Main Budget'!O68","v":0},{"$f":"Sumvisible(C21:K21)","v":0}]
[null,null,null,null,null,null,null,null,{"$f":"'Main Budget'!M86","v":0}]
["Other Direct Costs"]
["Equipment",null,{"$f":"'Main Budget'!G26","v":0},null,{"$f":"'Main Budget'!I26","v":0},null,{"$f":"'Main Budget'!K26","v":0},null,{"$f":"'Main Budget'!M26","v":0},null,{"$f":"'Main Budget'!O26","v":0},{"$f":"Sumvisible(C24:K24)","v":0}]
["Supplies, Materials, and Reproduction",null,{"$f":"'Main Budget'!G86+'Main Budget'!G87+'Main Budget'!G88","v":0},null,{"$f":"'Main Budget'!I86+'Main Budget'!I87+'Main Budget'!I88","v":0},null,{"$f":"'Main Budget'!K86+'Main Budget'!K87+'Main Budget'!K88","v":0},null,{"$f":"'Main Budget'!M86+'Main Budget'!M87+'Main Budget'!M88","v":0},null,{"$f":"'Main Budget'!O86+'Main Budget'!O87+'Main Budget'!O88","v":0},{"$f":"Sumvisible(C25:K25)","v":0}]
["Consultants, Subcontracts and Other",null,{"$f":"'Main Budget'!G89+'Main Budget'!G91+'Main Budget'!G95+'Main Budget'!G90","v":0},null,{"$f":"'Main Budget'!I89+'Main Budget'!I91+'Main Budget'!I95+'Main Budget'!I90","v":0},null,{"$f":"'Main Budget'!K89+'Main Budget'!K91+'Main Budget'!K95+'Main Budget'!K90","v":0},null,{"$f":"'Main Budget'!M89+'Main Budget'!M91+'Main Budget'!M95+'Main Budget'!M90","v":0},null,{"$f":"'Main Budget'!O89+'Main Budget'!O91+'Main Budget'!O95+'Main Budget'!O90","v":0},{"$f":"Sumvisible(C26:K26)","v":0}]
["Total Other Direct Costs",null,{"$f":"SUM(C24:C26)","v":0},null,{"$f":"SUM(E24:E26)","v":0},null,0,null,0,null,0,{"$f":"Sumvisible(C27:K27)","v":0}]
[]
["Total Direct Expenses",null,{"$f":"C13+C15+C17+C19+C21+C27","v":0},null,{"$f":"E13+E15+E17+E19+E21+E27","v":0},null,0,null,0,null,0,{"$f":"Sumvisible(C29:K29)","v":0}]
["Overhead on Direct Expenses",null,{"$f":"'Main Budget'!G100","v":0},null,{"$f":"'Main Budget'!I100","v":0},null,{"$f":"'Main Budget'!K100","v":0},null,{"$f":"'Main Budget'!M100","v":0},null,{"$f":"'Main Budget'!O100","v":0},{"$f":"Sumvisible(C30:K30)","v":0}]
{"$rows_left_out":2}
{"sheet":"Main Budget","index":1,"n_rows":102,"n_cols":17,"rows_kept":102,"cut":false,"hidden":false,"merged":[[1,6,1,15],[3,6,3,15],[4,6,4,15]]}
["Principal Investigator:",null,null,null,"Cost of Living Assumption"]
["Project Period Start",null,null,null,0.02]
["Project Period End"]
["Sponsor"]
["Title"]
[null,null,null,null,null,null,"Year 1",null,"Year 2",null,"Year 3",null,"Year 4",null,"Year 5","Total All Years"]
[null,null,null,null,null,null,{"$f":"CONCATENATE(TEXT($C$2, \"dd mmm 'yy\"),\"- \", TEXT(DATE(YEAR($C$2)+1,MONTH($C$2),DAY($C$2))-1, \"dd mmm 'yy\"))","v":"00 Jan '00- 30 Dec '00"},null,{"$f":"CONCATENATE(TEXT(DATE(YEAR($C$2)+1,MONTH($C$2),DAY($C$2)), \"dd mmm 'yy\"),\" - \", TEXT(DATE(YEAR($C$2)+2,MONTH($C$2),DAY($C$2))-1, \"dd mmm 'yy\"))","v":"31 Dec '00 - 30 Dec '01"},null,{"$f":"CONCATENATE(TEXT(DATE(YEAR($C$2)+2,MONTH($C$2),DAY($C$2)), \"dd mmm 'yy\"),\" - \", TEXT(DATE(YEAR($C$2)+3,MONTH($C$2),DAY($C$2))-1, \"dd mmm 'yy\"))","v":"31 Dec '01 - 30 Dec '02"},null,{"$f":"CONCATENATE(TEXT(DATE(YEAR($C$2)+3,MONTH($C$2),DAY($C$2)), \"dd mmm 'yy\"),\" - \", TEXT(DATE(YEAR($C$2)+4,MONTH($C$2),DAY($C$2))-1, \"dd mmm 'yy\"))","v":"31 Dec '02 - 30 Dec '03"},null,{"$f":"CONCATENATE(TEXT(DATE(YEAR($C$2)+4,MONTH($C$2),DAY($C$2)), \"dd mmm 'yy\"),\" - \", TEXT(DATE(YEAR($C$2)+5,MONTH($C$2),DAY($C$2))-1, \"dd mmm 'yy\"))","v":"31 Dec '03 - 30 Dec '04"},null,"Notes"]
["A. Personnel Costs"]
["Principal Investigator",{"$f":"'salary worksheet'!C10","v":6010},null,null,null,null,{"$f":"'salary worksheet'!J10","v":0},null,{"$f":"'salary worksheet'!L10","v":0},null,{"$f":"'salary worksheet'!N10","v":0},null,{"$f":"'salary worksheet'!P10","v":0},null,{"$f":"'salary worksheet'!R10","v":0},{"$f":"Sumvisible(G9:O9)","v":0}]
["Senior Faculty",{"$f":"'salary worksheet'!C10","v":6010},null,null,null,null,{"$f":"'salary worksheet'!J15-'salary worksheet'!J10","v":0},null,{"$f":"'salary worksheet'!L15-'salary worksheet'!L10","v":0},null,{"$f":"'salary worksheet'!N15-'salary worksheet'!N10","v":0},null,{"$f":"'salary worksheet'!P15-'salary worksheet'!P10","v":0},null,{"$f":"'salary worksheet'!R15-'salary worksheet'!R10","v":0},{"$f":"Sumvisible(G10:O10)","v":0}]
["Research Associates - Other Faculty",{"$f":"'salary worksheet'!C34","v":6030},null,null,null,null,{"$f":"'salary worksheet'!J39","v":0},null,{"$f":"'salary worksheet'!L39","v":0},null,{"$f":"'salary worksheet'!N39","v":0},null,{"$f":"'salary worksheet'!P39","v":0},null,{"$f":"'salary worksheet'!R39","v":0},0]
["Faculty Summer Salary",{"$f":"'salary worksheet'!C26","v":6040},null,null,null,null,{"$f":"'salary worksheet'!J31","v":0},null,{"$f":"'salary worksheet'!L31","v":0},null,{"$f":"'salary worksheet'!N31","v":0},null,{"$f":"'salary worksheet'!P31","v":0},null,{"$f":"'salary worksheet'!R31","v":0},0]
["Professional Exempt Staff",{"$f":"'salary worksheet'!C42","v":6050},null,null,null,null,{"$f":"'salary worksheet'!J44","v":0},null,{"$f":"'salary worksheet'!L44","v":0},null,{"$f":"'salary worksheet'!N44","v":0},null,{"$f":"'salary worksheet'!P44","v":0},null,{"$f":"'salary worksheet'!R44","v":0},0]
["Non-Exempt Staff",{"$f":"'salary worksheet'!C47","v":6070},null,null,null,null,{"$f":"'salary worksheet'!J47","v":0},null,{"$f":"'salary worksheet'!L47","v":0},null,{"$f":"'salary worksheet'!N47","v":0},null,{"$f":"'salary worksheet'!P47","v":0},null,{"$f":"'salary worksheet'!R47","v":0},0]
["Research and Teaching Assistants",{"$f":"CONCATENATE('salary worksheet'!C67, \", \", 'salary worksheet'!C76,\", \", 'salary worksheet'!C62)","v":"6110, 6120, 6140"},null,null,null,null,{"$f":"'salary worksheet'!J81+'salary worksheet'!J63+'salary worksheet'!J72","v":0},null,{"$f":"'salary worksheet'!L81+'salary worksheet'!L63+'salary worksheet'!L72","v":0},null,{"$f":"'salary worksheet'!N81+'salary worksheet'!N63+'salary worksheet'!N72","v":0},null,{"$f":"'salary worksheet'!P81+'salary worksheet'!P63+'salary worksheet'!P72","v":0},null,{"$f":"'salary worksheet'!R81+'salary worksheet'!R63+'salary worksheet'!R72","v":0},0]
["Post Docs",{"$f":"'salary worksheet'!C53","v":6150},null,null,null,null,{"$f":"'salary worksheet'!J54","v":0},null,{"$f":"'salary worksheet'!L54","v":0},null,{"$f":"'salary worksheet'!N54","v":0},null,{"$f":"'salary worksheet'!P54","v":0},null,{"$f":"'salary worksheet'!R54","v":0},{"$f":"Sumvisible(G16:O16)","v":0}]
[]
["Total Salary",null,null,null,null,null,{"$f":"SUM(G9:G16)","v":0},null,{"$f":"SUM(I9:I16)","v":0},null,0,null,0,null,0,{"$f":"Sumvisible(G18:O18)","v":0}]
[]
["Fringe Costs",null,null,null,null,null,{"$f":"'salary worksheet'!J85","v":0},null,{"$f":"'salary worksheet'!L85","v":0},null,{"$f":"'salary worksheet'!N85","v":0},null,{"$f":"'salary worksheet'!P85","v":0},null,{"$f":"'salary worksheet'!L85","v":0},{"$f":"Sumvisible(G20:O20)","v":0}]
[]
["Total Salary and Fringe",null,null,null,null,null,{"$f":"G18+G20","v":0},null,{"$f":"I18+I20","v":0},null,{"$f":"K18+K20","v":0},null,{"$f":"M18+M20","v":0},null,{"$f":"O18+O20","v":0},{"$f":"Sumvisible(G22:O22)","v":0}]
[]
["B. Equipment"]
["Itemize Equipment over $5,000",null,null,null,null,null,null,null,{"$f":"SUM(G25*(1+$E$2))","v":0},null,{"$f":"I25*(1+$E$2)","v":0},null,{"$f":"K25*(1+$E$2)","v":0},null,{"$f":"M25*(1+$E$2)","v":0},{"$f":"Sumvisible(G25:O25)","v":0}]
["Total Equipment",null,null,null,null,null,{"$f":"G25","v":0},null,{"$f":"I25","v":0},null,{"$f":"K25","v":0},null,0,null,0,{"$f":"Sumvisible(G26:O26)","v":0}]
[]
["C. Research Travel"]
["Faculty Travel",null,"Trips","People","Cost","Days"]
["Airfare (economy)","7650, 7670",null,null,null,null,{"$f":"C30*D30*E30","v":0},null,{"$f":"SUM(G30*(1+$E$2))","v":0},null,{"$f":"I30*(1+$E$2)","v":0},null,{"$f":"K30*(1+$E$2)","v":0},null,{"$f":"M30*(1+$E$2)","v":0},{"$f":"Sumvisible(G30:O30)","v":0}]
{"$rows_left_out":73}
{"sheet":"salary worksheet","index":2,"n_rows":86,"n_cols":20,"rows_kept":86,"cut":false,"hidden":false,"merged":[]}
[{"$f":"'Main Budget'!A1","v":"Principal Investigator:"},{"$f":"'Main Budget'!C1","v":0},null,null,null,null,null,null,null,null,"Cost of Living Increase",null,null,null,"Summer Months","% Effort"]
[{"$f":"'Main Budget'!A4","v":"Sponsor"},{"$f":"'Main Budget'!C4","v":0},null,null,null,null,null,null,null,null,"Faculty Increase",null,0.03,null,1,{"$f":"O2/9*0.95","v":0.10555555555555554},"Note: Harvard Policy is to only cover 95% of summer salary from grants"]
["Title",{"$f":"'Main Budget'!C5","v":0},null,null,null,{"$f":"IF(MONTH('Main Budget'!C2)<6,7-MONTH('Main Budget'!C2),19-MONTH('Main Budget'!C2))","v":6},"Number of Project Months in first Harvard FY",null,null,null,"Staff, RA, & Post-Doc Increase",null,0.03,null,2,{"$f":"O3/9*0.95","v":0.21111111111111108}]
["Project Start Date:",{"$f":"'Main Budget'!C2","v":"00:00:00"},null,null,null,null,null,null,null,null,null,null,null,null,3,{"$f":"O4/9*0.95","v":0.31666666666666665}]
["Project End Date:",{"$f":"'Main Budget'!C3","v":"00:00:00"}]
[]
[null,null,null,null,null,null,null,null,"Grant Year 1",null,"Grant Year 2",null,"Grant Year 3",null,"Grant Year 4",null,"Grant Year 5"]
[null,null,null,null,null,null,null,null,{"$f":"CONCATENATE(IF(MONTH('Main Budget'!$C$2)<7,CONCATENATE(\"FY\",YEAR('Main Budget'!$C$2)),CONCATENATE(\"FY\",YEAR('Main Budget'!$C$2)+1)),\" - \",IF(MONTH('Main Budget'!$C$2)<7,CONCATENATE(\"FY\",YEAR('Main Budget'!$C$2)+1),CONCATENATE(\"FY\",YEAR('Main Budget'!$C$2)+2)))","v":"FY1900 - FY1901"},null,{"$f":"CONCATENATE(IF(MONTH('Main Budget'!$C$2)<7,CONCATENATE(\"FY\",YEAR('Main Budget'!$C$2)+1),CONCATENATE(\"FY\",YEAR('Main Budget'!$C$2)+2)),\" - \",IF(MONTH('Main Budget'!$C$2)<7,CONCATENATE(\"FY\",YEAR('Main Budget'!$C$2)+2),CONCATENATE(\"FY\",YEAR('Main Budget'!$C$2)+3)))","v":"FY1901 - FY1902"},null,{"$f":"CONCATENATE(IF(MONTH('Main Budget'!$C$2)<7,CONCATENATE(\"FY\",YEAR('Main Budget'!$C$2)+2),CONCATENATE(\"FY\",YEAR('Main Budget'!$C$2)+3)),\" - \",IF(MONTH('Main Budget'!$C$2)<7,CONCATENATE(\"FY\",YEAR('Main Budget'!$C$2)+3),CONCATENATE(\"FY\",YEAR('Main Budget'!$C$2)+4)))","v":"FY1902 - FY1903"},null,{"$f":"CONCATENATE(IF(MONTH('Main Budget'!$C$2)<7,CONCATENATE(\"FY\",YEAR('Main Budget'!$C$2)+3),CONCATENATE(\"FY\",YEAR('Main Budget'!$C$2)+4)),\" - \",IF(MONTH('Main Budget'!$C$2)<7,CONCATENATE(\"FY\",YEAR('Main Budget'!$C$2)+4),CONCATENATE(\"FY\",YEAR('Main Budget'!$C$2)+5)))","v":"FY1903 - FY1904"},null,{"$f":"CONCATENATE(IF(MONTH('Main Budget'!$C$2)<7,CONCATENATE(\"FY\",YEAR('Main Budget'!$C$2)+4),CONCATENATE(\"FY\",YEAR('Main Budget'!$C$2)+5)),\" - \",IF(MONTH('Main Budget'!$C$2)<7,CONCATENATE(\"FY\",YEAR('Main Budget'!$C$2)+5),CONCATENATE(\"FY\",YEAR('Main Budget'!$C$2)+6)))","v":"FY1904 - FY1905"}]
["Position","Position Type","Object Code","Name","Notes","FTE Salary Base","FTE",null,"% Effort","Total","% Effort","Total","% Effort",null,"% Effort",null,"% Effort",null,"Project Total"]
["Principal Investigator","Faculty",6010,null,null,null,1,null,0,{"$f":"F10*G10*I10*(1+$M$2*$F$3/12)","v":0},{"$f":"$I10","v":0},{"$f":"$F10*(1+$M$2)*(1+$M$2*$F$3/12)*K10*G10","v":0},{"$f":"$I10","v":0},{"$f":"$F10*(1+$M$2)^2*(1+$M$2*$F$3/12)*G10*M10","v":0},{"$f":"$I10","v":0},{"$f":"$F10*(1+$M$2)^3*(1+$M$2*$F$3/12)*G10*O10","v":0},{"$f":"$I10","v":0},{"$f":"$F10*(1+$M$2)^4*(1+$M$2*$F$3/12)*G10*Q10","v":0},{"$f":"J10+L10+N10+P10+R10","v":0}]
["Faculty ","Faculty",6010,null,null,null,1,null,0,{"$f":"F11*G11*I11*(1+$M$2*$F$3/12)","v":0},0,{"$f":"$F11*(1+$M$2)*(1+$M$2*$F$3/12)*K11*G11","v":0},{"$f":"$I11","v":0},{"$f":"$F11*(1+$M$2)^2*(1+$M$2*$F$3/12)*G11*M11","v":0},{"$f":"$I11","v":0},{"$f":"$F11*(1+$M$2)^3*(1+$M$2*$F$3/12)*G11*O11","v":0},{"$f":"$I11","v":0},{"$f":"$F11*(1+$M$2)^4*(1+$M$2*$F$3/12)*G11*Q11","v":0},{"$f":"J11+L11+N11+P11+R11","v":0}]
["Faculty ","Faculty",6020,null,null,null,1,null,0,0,0,0,0,0,0,0,0,0,0]
["Faculty ","Faculty",6020,null,null,null,1,null,0,0,0,0,0,0,0,0,0,0,{"$f":"J13+L13+N13+P13+R13","v":0}]
["Faculty ","Faculty",6020,null,null,null,1,null,0,0,0,0,0,0,0,0,0,0,{"$f":"J14+L14+N14+P14+R14","v":0}]
["Subtotal Principal Investigator",null,null,null,null,null,null,null,null,{"$f":"SUM(J10:J14)","v":0},null,{"$f":"SUM(L10:L14)","v":0},null,{"$f":"SUM(N10:N14)","v":0},null,{"$f":"SUM(P10:P14)","v":0},null,{"$f":"SUM(R10:R14)","v":0},{"$f":"SUM(J15:R15)","v":0},{"$f":"S15-SUM(J15:R15)","v":0}]
["Faculty Fringe",null,null,null,null,null,null,null,null,{"$f":"($F$3*'fringe rates table'!$C$5+(12-$F$3)*'fringe rates table'!$D$5)/12*J15","v":0},null,{"$f":"($F$3*'fringe rates table'!$D$5+(12-$F$3)*'fringe rates table'!$E$5)/12*L15","v":0},null,{"$f":"($F$3*'fringe rates table'!$E$5+(12-$F$3)*'fringe rates table'!$F$5)/12*N15","v":0},null,{"$f":"($F$3*'fringe rates table'!$F$5+(12-$F$3)*'fringe rates table'!$G$5)/12*P15","v":0},null,{"$f":"($F$3*'fringe rates table'!$G$5+(12-$F$3)*'fringe rates table'!$H$5)/12*R15","v":0},{"$f":"SUM(I16:R16)","v":0}]
[]
["Faculty Instruction","Faculty",6010,null,null,null,1,null,0,{"$f":"F18*G18*I18*(1+$M$2*$F$3/12)","v":0},{"$f":"$I18","v":0},{"$f":"$F18*(1+$M$2)*(1+$M$2*$F$3/12)*K18*G18","v":0},{"$f":"$I18","v":0},{"$f":"$F18*(1+$M$2)^2*(1+$M$2*$F$3/12)*G18*M18","v":0},{"$f":"$I18","v":0},{"$f":"$F18*(1+$M$2)^3*(1+$M$2*$F$3/12)*G18*O18","v":0},{"$f":"$I18","v":0},{"$f":"$F18*(1+$M$2)^4*(1+$M$2*$F$3/12)*G18*Q18","v":0},{"$f":"J18+L18+N18+P18+R18","v":0}]
["Faculty ","Faculty",6010,null,null,null,1,null,0,0,0,0,0,0,0,0,0,0,{"$f":"J19+L19+N19+P19+R19","v":0}]
["Faculty ","Faculty",6020,null,null,null,1,null,0,0,0,0,0,0,0,0,0,0,0]
["Faculty ","Faculty",6020,null,null,null,1,null,0,0,0,0,0,0,0,0,0,0,0]
["Faculty ","Faculty",6020,null,null,null,1,null,0,0,0,0,0,0,0,0,0,0,0]
["Subtotal Senior Faculty",null,null,null,null,null,null,null,null,{"$f":"SUM(J18:J22)","v":0},null,{"$f":"SUM(L18:L22)","v":0},null,{"$f":"SUM(N18:N22)","v":0},null,{"$f":"SUM(P18:P22)","v":0},null,{"$f":"SUM(R18:R22)","v":0},{"$f":"SUM(J23:R23)","v":0},{"$f":"S23-SUM(J23:R23)","v":0}]
["Faculty Fringe",null,null,null,null,null,null,null,null,{"$f":"($F$3*'fringe rates table'!$C$5+(12-$F$3)*'fringe rates table'!$D$5)/12*J23","v":0},null,{"$f":"($F$3*'fringe rates table'!$D$5+(12-$F$3)*'fringe rates table'!$E$5)/12*L23","v":0},null,{"$f":"($F$3*'fringe rates table'!$E$5+(12-$F$3)*'fringe rates table'!$F$5)/12*N23","v":0},null,{"$f":"($F$3*'fringe rates table'!$F$5+(12-$F$3)*'fringe rates table'!$G$5)/12*P23","v":0},null,{"$f":"($F$3*'fringe rates table'!$G$5+(12-$F$3)*'fringe rates table'!$H$5)/12*R23","v":0},{"$f":"SUM(I24:R24)","v":0}]
[]
["Principal Investigator Summer Salary","Faculty",6040,null,null,{"$f":"F10","v":0},1,null,null,{"$f":"F26*G26*I26*(1+$M$2*$F$3/12)","v":0},{"$f":"$I26","v":0},{"$f":"$F26*(1+$M$2)*(1+$M$2*$F$3/12)*K26*G26","v":0},{"$f":"$I26","v":0},{"$f":"$F26*(1+$M$2)^2*(1+$M$2*$F$3/12)*G26*M26","v":0},{"$f":"$I26","v":0},{"$f":"$F26*(1+$M$2)^3*(1+$M$2*$F$3/12)*G26*O26","v":0},{"$f":"$I26","v":0},{"$f":"$F26*(1+$M$2)^4*(1+$M$2*$F$3/12)*G26*Q26","v":0},{"$f":"J26+L26+N26+P26+R26","v":0}]
["Faculty Summer Salary","Faculty",6040,null,null,0,1,null,null,{"$f":"F27*G27*I27*(1+$M$2*$F$3/12)","v":0},{"$f":"$I27","v":0},0,0,0,0,0,0,0,0]
["Faculty Summer Salary","Faculty",6040,null,null,0,1,null,null,0,{"$f":"$I28","v":0},0,0,0,0,0,0,0,0]
["Faculty Summer Salary","Faculty",6040,null,null,0,1,null,null,{"$f":"F29*G29*I29*(1+$M$2*$F$3/12)","v":0},{"$f":"$I29","v":0},{"$f":"$F29*(1+$M$2)*(1+$M$2*$F$3/12)*K29*G29","v":0},0,{"$f":"$F29*(1+$M$2)^2*(1+$M$2*$F$3/12)*G29*M29","v":0},0,{"$f":"$F29*(1+$M$2)^3*(1+$M$2*$F$3/12)*G29*O29","v":0},0,{"$f":"$F29*(1+$M$2)^4*(1+$M$2*$F$3/12)*G29*Q29","v":0},{"$f":"J29+L29+N29+P29+R29","v":0}]
["Faculty Summer Salary","Faculty",6040,null,null,0,1,null,null,0,{"$f":"$I30","v":0},0,0,0,0,0,0,0,0]
{"$rows_left_out":57}
{"sheet":"fringe rates table","index":3,"n_rows":31,"n_cols":8,"rows_kept":31,"cut":false,"hidden":false,"merged":[]}
["Fringe & Vacation Assessment Rates"]
["University Area",null,"FY15","FY16","FY17","FY18","FY19","FY20"]
[null,"Start Date:","2014-07-01","2015-07-01","2016-07-01","2017-07-01","2018-07-01","2019-07-01"]
[null,"End Date:","2015-06-30","2016-06-30","2017-06-30","2018-06-30","2019-06-30","2020-06-30"]
["Faculty & Other Academic","6010, 6020, 6030, 6040",0.247,0.26400000000000001,0.26700000000000002,0.26700000000000002,0.26700000000000002,0.26700000000000002]
["Post-Docs","6150",0.23200000000000001,0.251,0.25900000000000001,0.25900000000000001,0.25900000000000001,0.25900000000000001]
["Teaching Assistants","6152",0.17599999999999999,0.19,0.193,0.193,0.193,0.193]
["Exempt (Fringe + Vacation)","6050, 6051",{"$f":"+C17+C18","v":0.42799999999999999},0.442,0.44500000000000001,0.44500000000000001,0.44500000000000001,{"$f":"+H17+H18","v":0.44500000000000001}]
["Non-Exempt (Fringe + Vacation)","6070, 6071, 6080",{"$f":"+C21+C22","v":0.55900000000000005},0.57799999999999996,0.58399999999999996,0.58399999999999996,{"$f":"+G21+G22","v":0.58399999999999996},0.58399999999999996]
["Temporary, Unenrolled","6090, 6120",7.6999999999999999E-2,9.0999999999999998E-2,9.7000000000000003E-2,9.7000000000000003E-2,9.7000000000000003E-2,9.7000000000000003E-2]
["Extra Compensation, Pensionable","6190, 6191",0.15,0.15,0.15,0.15,0.15,0.15]
["Extra Compensation, Non-pensionable","6200-6204",0.08,0.08,0.08,0.08,0.08,0.08]
["Enrolled Students","6110",0,0,0,0,0,0]
[]
[]
["Admin & Professional"]
["Fringe",null,0.32200000000000001,0.33800000000000002,0.33900000000000002,0.33900000000000002,0.33900000000000002,0.33900000000000002]
["Vacation Fringe",null,0.106,0.104,0.106,0.106,0.106,0.106]
[]
["Clerical/Technical, Service and Trade"]
["Fringe",null,0.45500000000000002,0.47599999999999998,0.48,0.48,0.48,0.48]
["Vacation Fringe",null,0.104,0.10199999999999999,0.104,0.104,0.104,0.104]
[]
[]
["PI Instruction"]
["PI Additional Effort"]
["PI Course Buyout"]
[]
["Faculty Instruction"]
["Faculty Additional Effort"]
{"$rows_left_out":2}
{"sheet":"Assumptions","index":4,"n_rows":8,"n_cols":1,"rows_kept":8,"cut":false,"hidden":false,"merged":[]}
["Assumptions"]
["All Grants are assumed to run for full years. Partial year grants should have the effort figures adjusted for the final year so that they represent % of full year effort. (So for example an 18 month grant that the PI is at 50% effort on should have 25% effort entered for the last year. 50% times 6 months remaining divided by 12 months = 25%)"]
["Fringe and salary calculations are based on the assumption that grants begin on the first of the month. Grants which begin on other dates (particularly those which begin in the last couple days of the month) may result in incorrect months or fiscal years displayed in column headings, and slight variations (on the order of a tenth of a percent) in salary and fringe calculations."]
["Expenses are assumed to be distributed evenly across the years of the grant with a slight increase to account for inflation. Expenses which will not be evenly distributed (for example a grant which has a single workshop across two years) should be entered manually into the appropriate year column of the main budget spreadsheet."]
["By default, the spreadsheet assumes that effort percentages will be constant across the years of the grant, though this can be manually edited in the salary worksheet."]
["The spreadsheet assumes all costs are subject to overhead."]
["Grants are assumed to start in FY15. For grants starting in later years, delete the FY15 column (Column C) in the fringe rates table and add a FY21 column to the right of the fringe rates table."]
["PER DIEMS: The per diem rate for M&IE includes the following items: all meals, room service, laundry, dry cleaning and pressing of clothing, and fees and tips for persons who provide services, such as food servers and luggage handlers."]